Target
Adenosine receptor A3
Ligand
BDBM50299704
Substrate
Meas. Tech.
ChEMBL_588683 (CHEMBL1056093)
EC50
363±n/a nM
Citation
 Volpini, RBuccioni, MDal Ben, DLambertucci, CLammi, CMarucci, GRamadori, ATKlotz, KNCristalli, G Synthesis and biological evaluation of 2-alkynyl-N6-methyl-5'-N-methylcarboxamidoadenosine derivatives as potent and highly selective agonists for the human adenosine A3 receptor. J Med Chem 52:7897-900 (2009)  
Target
Name:
Adenosine receptor A3
Synonyms:
A3 adenosine receptor (hA3) ADORA3 | Adenosine A3 receptor (A3AR)
Type:
G Protein-Coupled Receptor (GPCR)
Mol. Mass.:
36197.32
Organism:
Homo sapiens (Human)
Description:
P0DMS8
Residue:
318
  
Inhibitor
Name:
BDBM50299704
Synonyms:
(2S,3S,4R,5R)-5-(2-chloro-6-(4-iodobenzylamino)-9H-purin-9-yl)-3,4-dihydroxy-N-methyltetrahydrofuran-2-carboxamide | CHEMBL574181
Type:
Small organic molecule
Emp. Form.:
C18H18ClIN6O4
Mol. Mass.:
544.731
SMILES:
CNC(=O)[C@H]1O[C@H]([C@H](O)[C@@H]1O)n1cnc2c(NCc3ccc(I)cc3)nc(Cl)nc12
: