Target
Adenosine receptor A1
Ligand
BDBM50205729
Substrate
Meas. Tech.
ChEMBL_588678 (CHEMBL1056088)
Ki
3990±n/a nM
Citation
 Volpini, RBuccioni, MDal Ben, DLambertucci, CLammi, CMarucci, GRamadori, ATKlotz, KNCristalli, G Synthesis and biological evaluation of 2-alkynyl-N6-methyl-5'-N-methylcarboxamidoadenosine derivatives as potent and highly selective agonists for the human adenosine A3 receptor. J Med Chem 52:7897-900 (2009)  
Target
Name:
Adenosine receptor A1
Synonyms:
A1 adenosine receptor (hA1) AA1R_HUMAN ADORA1 Adenosine A1-receptor Adenosine receptor A1 (hA1) | Adenosine transporter (AdT)
Type:
G Protein-Coupled Receptor (GPCR)
Mol. Mass.:
36520.92
Organism:
Homo sapiens (Human)
Description:
P30542
Residue:
326
  
Inhibitor
Name:
BDBM50205729
Synonyms:
(2S,3S,4R,5R)-3,4-dihydroxy-5-(6-(methoxyamino)-2-(pyridin-2-ylethynyl)-9H-purin-9-yl)-N-methyltetrahydrofuran-2-carboxamide N6-methoxy-2-[(2-pyridinyl)ethynyl]-5'-N-methylcarboxamidoadenosine
Type:
Small organic molecule
Emp. Form.:
C19H19N7O5
Mol. Mass.:
425.3981
SMILES:
CNC(=O)[C@H]1O[C@H]([C@H](O)[C@@H]1O)n1cnc2c(NOC)nc(nc12)C#Cc1ccccn1
: