Target
Adenosine receptor A1
Ligand
BDBM50299697
Substrate
Meas. Tech.
ChEMBL_588678 (CHEMBL1056088)
Ki
8740±n/a nM
Citation
 Volpini, RBuccioni, MDal Ben, DLambertucci, CLammi, CMarucci, GRamadori, ATKlotz, KNCristalli, G Synthesis and biological evaluation of 2-alkynyl-N6-methyl-5'-N-methylcarboxamidoadenosine derivatives as potent and highly selective agonists for the human adenosine A3 receptor. J Med Chem 52:7897-900 (2009)  
Target
Name:
Adenosine receptor A1
Synonyms:
A1 adenosine receptor (hA1) AA1R_HUMAN ADORA1 Adenosine A1-receptor Adenosine receptor A1 (hA1) | Adenosine transporter (AdT)
Type:
G Protein-Coupled Receptor (GPCR)
Mol. Mass.:
36520.92
Organism:
Homo sapiens (Human)
Description:
P30542
Residue:
326
  
Inhibitor
Name:
BDBM50299697
Synonyms:
2-(2-Pyridinyl)ethynyl-N6-methyl-5'-N-methylcarboxamidoadenosine | CHEMBL575027
Type:
Small organic molecule
Emp. Form.:
C19H19N7O4
Mol. Mass.:
409.3987
SMILES:
CNC(=O)[C@H]1O[C@H]([C@H](O)[C@@H]1O)n1cnc2c(NC)nc(nc12)C#Cc1ccccn1
: