Target
Adenosine receptor A2a
Ligand
BDBM50299703
Substrate
Meas. Tech.
ChEMBL_588679 (CHEMBL1056089)
Ki
12700±n/a nM
Citation
 Volpini, RBuccioni, MDal Ben, DLambertucci, CLammi, CMarucci, GRamadori, ATKlotz, KNCristalli, G Synthesis and biological evaluation of 2-alkynyl-N6-methyl-5'-N-methylcarboxamidoadenosine derivatives as potent and highly selective agonists for the human adenosine A3 receptor. J Med Chem 52:7897-900 (2009)  
Target
Name:
Adenosine receptor A2a
Synonyms:
A2A adenosine receptor (hA2A) ADENOSINE A2 ADORA2 Adenosine A2A receptor (A2AAR)
Type:
G Protein-Coupled Receptor (GPCR)
Mol. Mass.:
44716.46
Organism:
Homo sapiens (Human)
Description:
P29274
Residue:
412
  
Inhibitor
Name:
BDBM50299703
Synonyms:
2-(4-Fluorophenyl)ethynyl-N6-methyl-5'-N-methylcarboxamidoadenosine | CHEMBL573269
Type:
Small organic molecule
Emp. Form.:
C20H19FN6O4
Mol. Mass.:
426.4011
SMILES:
CNC(=O)[C@H]1O[C@H]([C@H](O)[C@@H]1O)n1cnc2c(NC)nc(nc12)C#Cc1ccc(F)cc1
: