Target
Delta-type opioid receptor
Ligand
BDBM50195656
Substrate
Meas. Tech.
ChEMBL_588897 (CHEMBL1061221)
Ki
2.7±n/a nM
Citation
 Nieland, NPRennison, DBroadbear, JHPurington, LWoods, JHTraynor, JRLewis, JWHusbands, SM 14beta-Arylpropiolylamino-17-cyclopropylmethyl-7,8-dihydronormorphinones and related opioids. Further examples of pseudoirreversible mu opioid receptor antagonists. J Med Chem 52:6926-30 (2009)  
Target
Name:
Delta-type opioid receptor
Synonyms:
D-OR-1 Delta opioid receptor OPIATE Delta OPRD1 OPRK1 | opioid receptor, delta 1
Type:
G Protein-Coupled Receptor (GPCR)
Mol. Mass.:
40382.98
Organism:
Homo sapiens (Human)
Description:
Competition binding assays were carried out using membrane preparations from transfected HN9.10 cells that constitutively expressed the delta opioid receptor.
Residue:
372
  
Inhibitor
Name:
BDBM50195656
Synonyms:
14beta-4'-Chlorocinnamoylaminodihydronormorphinone C-CAM clocinnamox
Type:
Small organic molecule
Emp. Form.:
C29H29ClN2O4
Mol. Mass.:
505.005
SMILES:
Oc1ccc2C[C@H]3N(CC4CC4)CC[C@@]45[C@@H](Oc1c24)C(=O)CC[C@@]35NC(=O)\C=C\c1ccc(Cl)cc1
: