Target
Hematopoietic prostaglandin D synthase
Ligand
BDBM50186231
Substrate
Meas. Tech.
ChEMBL_593692 (CHEMBL1044145)
IC50
1.223E5±n/a nM
Citation
 Weber, JEOakley, AJChrist, ANClark, AGHayes, JDHall, RHume, DABoard, PGSmythe, MLFlanagan, JU Identification and characterisation of new inhibitors for the human hematopoietic prostaglandin D2 synthase. Eur J Med Chem 45:447-54 (2010)  
Target
Name:
Hematopoietic prostaglandin D synthase
Synonyms:
GSTS Glutathione-requiring prostaglandin D synthase HPGDS Hematopoietic prostaglandin D synthase Hematopoietic prostaglandin D synthase (HPGDS) PTGDS2 Prostaglandin D Synthase
Type:
Enzyme
Mol. Mass.:
23341.07
Organism:
Homo sapiens (Human)
Description:
The protein was expressed in E. coli strain BL21(DE3) with an N-terminal 6-His tag.
Residue:
199
  
Inhibitor
Name:
BDBM50186231
Synonyms:
(2,3-Dichloro-4-(2-methylene-1-oxobutyl)phenoxy)acetic acid ETHACRYNIC ACID Etacrinic acid Hydromedin [2,3-dichloro-4-(2-methylidenebutanoyl)phenoxy]acetic acid | jm5b01461, Compound 72
Type:
Small organic molecule
Emp. Form.:
C13H12Cl2O4
Mol. Mass.:
303.138
SMILES:
CCC(=C)C(=O)c1ccc(OCC(O)=O)c(Cl)c1Cl
: