Target
5-hydroxytryptamine receptor 6
Ligand
BDBM50300674
Substrate
Meas. Tech.
ChEMBL_589212 (CHEMBL1041206)
Ki
2.2±n/a nM
Citation
 Mesquida, NLópez-Pérez, SDinarès, IFrigola, JMercè, RHolenz, JPérez, RBurgueño, JAlcalde, E Identification of novel indanylsulfonamide guanylhydrazones as potent 5-HT6 serotonin receptor antagonists. J Med Chem 52:6153-7 (2009)  
Target
Name:
5-hydroxytryptamine receptor 6
Synonyms:
5-HT-6 5-hydroxytryptamine receptor 6 (5-HT-6) 5-hydroxytryptamine receptor 6 (5HT6) HTR6 Serotonin 6 (5-HT6) receptor | Serotonin Receptor 6
Type:
G Protein-Coupled Receptor (GPCR)
Mol. Mass.:
46968.43
Organism:
Homo sapiens (Human)
Description:
P50406
Residue:
440
  
Inhibitor
Name:
BDBM50300674
Synonyms:
6-chloro-N-[3-(4,5-dihydro-1H-imidazol-2-ylhydrazono)-2,3-dihydro-1H-inden-5-yl]imidazo[2,1-b][1,3]thiazole-5-sulfonamide | CHEMBL574403
Type:
Small organic molecule
Emp. Form.:
C17H16ClN7O2S2
Mol. Mass.:
449.938
SMILES:
Clc1nc2sccn2c1S(=O)(=O)Nc1ccc2CC\C(=N/NC3=NCCN3)c2c1
: