Target
5-hydroxytryptamine receptor 6
Ligand
BDBM50300672
Substrate
Meas. Tech.
ChEMBL_589216 (CHEMBL1041210)
IC50
238±n/a nM
Citation
 Mesquida, NLópez-Pérez, SDinarès, IFrigola, JMercè, RHolenz, JPérez, RBurgueño, JAlcalde, E Identification of novel indanylsulfonamide guanylhydrazones as potent 5-HT6 serotonin receptor antagonists. J Med Chem 52:6153-7 (2009)  
Target
Name:
5-hydroxytryptamine receptor 6
Synonyms:
5-HT-6 5-hydroxytryptamine receptor 6 (5-HT-6) 5-hydroxytryptamine receptor 6 (5HT6) HTR6 Serotonin 6 (5-HT6) receptor | Serotonin Receptor 6
Type:
G Protein-Coupled Receptor (GPCR)
Mol. Mass.:
46968.43
Organism:
Homo sapiens (Human)
Description:
P50406
Residue:
440
  
Inhibitor
Name:
BDBM50300672
Synonyms:
2-(6-{[(6-chloroimidazo[2,1-b][1,3]thiazol-5-yl)sulfonyl]amino}-3,3-dimethyl-2,3-dihydro-1H-inden-1-ylidene)hydrazinecarboximidamide hydrochloride | CHEMBL575270
Type:
Small organic molecule
Emp. Form.:
C17H18ClN7O2S2
Mol. Mass.:
451.954
SMILES:
CC1(C)C\C(=N/NC(N)=N)c2cc(NS(=O)(=O)c3c(Cl)nc4sccn34)ccc12
: