Target
5-hydroxytryptamine receptor 1A
Ligand
BDBM50300669
Substrate
Meas. Tech.
ChEMBL_589219 (CHEMBL1041213)
IC50
>10000±n/a nM
Citation
 Mesquida, NLópez-Pérez, SDinarès, IFrigola, JMercè, RHolenz, JPérez, RBurgueño, JAlcalde, E Identification of novel indanylsulfonamide guanylhydrazones as potent 5-HT6 serotonin receptor antagonists. J Med Chem 52:6153-7 (2009)  
Target
Name:
5-hydroxytryptamine receptor 1A
Synonyms:
5-HT-1A 5-hydroxytryptamine receptor 1A (5-HT-1A) ADRB2RL1 Dopamine D2 receptor and serotonin 1a receptor HTR1A | Serotonin receptor 1A
Type:
Mol. Mass.:
46122.49
Organism:
Homo sapiens (Human)
Description:
Residue:
422
  
Inhibitor
Name:
BDBM50300669
Synonyms:
2-(6-{[(6-Chloroimidazo[2,1-b][1,3]thiazol-5-yl)sulfonyl]amino}-2,3-dihydro-1H-inden-1-ylidene)hydrazinecarboximidamide hydrochloride | CHEMBL577570
Type:
Small organic molecule
Emp. Form.:
C15H14ClN7O2S2
Mol. Mass.:
423.9
SMILES:
NC(=N)N\N=C1/CCc2ccc(NS(=O)(=O)c3c(Cl)nc4sccn34)cc12
: