Target
5-hydroxytryptamine receptor 6
Ligand
BDBM34152
Substrate
Meas. Tech.
ChEMBL_589226 (CHEMBL1041220)
Ki
2.2±n/a nM
Citation
 Mesquida, NLópez-Pérez, SDinarès, IFrigola, JMercè, RHolenz, JPérez, RBurgueño, JAlcalde, E Identification of novel indanylsulfonamide guanylhydrazones as potent 5-HT6 serotonin receptor antagonists. J Med Chem 52:6153-7 (2009)  
Target
Name:
5-hydroxytryptamine receptor 6
Synonyms:
5-HT-6 5-hydroxytryptamine receptor 6 (5-HT-6) 5-hydroxytryptamine receptor 6 (5HT6) HTR6 Serotonin 6 (5-HT6) receptor | Serotonin Receptor 6
Type:
G Protein-Coupled Receptor (GPCR)
Mol. Mass.:
46968.43
Organism:
Homo sapiens (Human)
Description:
P50406
Residue:
440
  
Inhibitor
Name:
BDBM34152
Synonyms:
CHEMBL362628 | E-6801
Type:
Small organic molecule
Emp. Form.:
C17H18ClN5O2S2
Mol. Mass.:
423.94
SMILES:
CN(C)CCc1c[nH]c2ccc(NS(=O)(=O)c3c(Cl)nc4sccn34)cc12
: