Target
5-hydroxytryptamine receptor 6
Ligand
BDBM50300676
Substrate
Meas. Tech.
ChEMBL_589223 (CHEMBL1041217)
Ki
1±n/a nM
Citation
 Mesquida, NLópez-Pérez, SDinarès, IFrigola, JMercè, RHolenz, JPérez, RBurgueño, JAlcalde, E Identification of novel indanylsulfonamide guanylhydrazones as potent 5-HT6 serotonin receptor antagonists. J Med Chem 52:6153-7 (2009)  
Target
Name:
5-hydroxytryptamine receptor 6
Synonyms:
5-HT-6 5-hydroxytryptamine receptor 6 (5-HT-6) 5-hydroxytryptamine receptor 6 (5HT6) HTR6 Serotonin 6 (5-HT6) receptor | Serotonin Receptor 6
Type:
G Protein-Coupled Receptor (GPCR)
Mol. Mass.:
46968.43
Organism:
Homo sapiens (Human)
Description:
P50406
Residue:
440
  
Inhibitor
Name:
BDBM50300676
Synonyms:
2-(1-(5-(4-methoxyphenylsulfonamido)-1H-indol-3-yl)ethylidene)hydrazinecarboximidamide | CHEMBL578023
Type:
Small organic molecule
Emp. Form.:
C18H20N6O3S
Mol. Mass.:
400.455
SMILES:
COc1ccc(cc1)S(=O)(=O)Nc1ccc2[nH]cc(C(C)=NN=C(N)N)c2c1
: