Target
cGMP-specific 3',5'-cyclic phosphodiesterase
Ligand
BDBM50300979
Substrate
Meas. Tech.
ChEMBL_597959 (CHEMBL1042744)
IC50
1.2±n/a nM
Citation
 Hughes, ROWalker, JKRogier, DJHeasley, SEBlevis-Bal, RMBenson, AGJacobsen, EJCubbage, JWFobian, YMOwen, DRFreskos, JNMolyneaux, JMBrown, DLAcker, BAMaddux, TMTollefson, MBMoon, JBMischke, BVRumsey, JMZheng, YMacInnes, ABond, BRYu, Y Optimization of the aminopyridopyrazinones class of PDE5 inhibitors: discovery of 3-[(trans-4-hydroxycyclohexyl)amino]-7-(6-methoxypyridin-3-yl)-1-(2-propoxyethyl)pyrido[3,4-b]pyrazin-2(1H)-one. Bioorg Med Chem Lett 19:5209-13 (2009)  
Target
Name:
cGMP-specific 3',5'-cyclic phosphodiesterase
Synonyms:
3',5'-cyclic phosphodiesterase PDE5 PDE5A_HUMAN Phosphodiesterase 5 (PDE5) Phosphodiesterase 5A (PDE5A) cGMP-specific 3',5'-cyclic phosphodiesterase
Type:
Protein
Mol. Mass.:
99975.83
Organism:
Homo sapiens (Human)
Description:
O76074
Residue:
875
  
Inhibitor
Name:
BDBM50300979
Synonyms:
7-(6-methoxypyridin-3-yl)-3-(2-morpholino-2-oxoethylamino)-1-(2-propoxyethyl)pyrido[2,3-b]pyrazin-2(1H)-one | CHEMBL569265
Type:
Small organic molecule
Emp. Form.:
C24H30N6O5
Mol. Mass.:
482.5322
SMILES:
CCCOCCn1c2cc(cnc2nc(NCC(=O)N2CCOCC2)c1=O)-c1ccc(OC)nc1
: