Target
Melanin-concentrating hormone receptor 1
Ligand
BDBM50301100
Substrate
Meas. Tech.
ChEMBL_598541 (CHEMBL1043533)
IC50
34±n/a nM
Citation
 Ando, MSekino, EHaga, YMoriya, MIto, MIto, JIwaasa, HIshihara, AKanatani, AOhtake, N Discovery of novel phenethylpyridone derivatives as potent melanin-concentrating hormone 1 receptor antagonists. Bioorg Med Chem Lett 19:5186-90 (2009)  
Target
Name:
Melanin-concentrating hormone receptor 1
Synonyms:
G-protein coupled receptor 24 MCH receptor 1 MCH-R1 MCHR-1 MCHR1_HUMAN Melanin-Concentrating Hormone Receptor 1 (MCH1R) Melanin-concentrating hormone receptor 1 (MCH-1) Melanin-concentrating hormone receptor 1 (MCHR-1) SLC-1 Somatostatin receptor-like protein
Type:
G Protein-Coupled Receptor (GPCR)
Mol. Mass.:
45976.27
Organism:
Homo sapiens (Human)
Description:
Membranes from CHO-K1 cells stably expressing human MCH1R were used in assays.
Residue:
422
  
Inhibitor
Name:
BDBM50301100
Synonyms:
4-(4-fluorobenzyloxy)-1-(4-((propylamino)methyl)benzyloxy)pyridin-2(1H)-one | CHEMBL566674
Type:
Small organic molecule
Emp. Form.:
C23H25FN2O3
Mol. Mass.:
396.4546
SMILES:
CCCNCc1ccc(COn2ccc(OCc3ccc(F)cc3)cc2=O)cc1
: