Target
Muscarinic acetylcholine receptor M1
Ligand
BDBM50301095
Substrate
Meas. Tech.
ChEMBL_598552 (CHEMBL1043544)
IC50
>5000±n/a nM
Citation
 Ando, MSekino, EHaga, YMoriya, MIto, MIto, JIwaasa, HIshihara, AKanatani, AOhtake, N Discovery of novel phenethylpyridone derivatives as potent melanin-concentrating hormone 1 receptor antagonists. Bioorg Med Chem Lett 19:5186-90 (2009)  
Target
Name:
Muscarinic acetylcholine receptor M1
Synonyms:
ACM1_HUMAN Cholinergic receptor, muscarinic 1 | Cholinergic, muscarinic M1
Type:
Protein
Mol. Mass.:
51442.54
Organism:
Homo sapiens (Human)
Description:
P11229
Residue:
460
  
Inhibitor
Name:
BDBM50301095
Synonyms:
4-(4-fluorobenzyloxy)-1-(4-((propylamino)methyl)phenethyl)pyridin-2(1H)-one | CHEMBL570296
Type:
Small organic molecule
Emp. Form.:
C24H27FN2O2
Mol. Mass.:
394.4818
SMILES:
CCCNCc1ccc(CCn2ccc(OCc3ccc(F)cc3)cc2=O)cc1
: