Target
Neuropeptide Y receptor type 2
Ligand
BDBM50301193
Substrate
Meas. Tech.
ChEMBL_598774 (CHEMBL1042014)
IC50
>10000±n/a nM
Citation
 Kameda, MAndo, MNakama, CKobayashi, KKawamoto, HIto, SSuzuki, TTani, TOzaki, STokita, SSato, N Synthesis and evaluation of a series of 2,4-diaminopyridine derivatives as potential positron emission tomography tracers for neuropeptide Y Y1 receptors. Bioorg Med Chem Lett 19:5124-7 (2009)  
Target
Name:
Neuropeptide Y receptor type 2
Synonyms:
NPY-Y2 NPY2-R NPY2R_HUMAN Y2 receptor | neuropeptide Y receptor Y2
Type:
Enzyme Catalytic Domain
Mol. Mass.:
42734.65
Organism:
Homo sapiens (Human)
Description:
NPY-Y2 NPY2R HUMAN::P49146
Residue:
381
  
Inhibitor
Name:
BDBM50301193
Synonyms:
6-((5-ethyl-4-(fluoromethyl)thiazol-2-ylthio)methyl)-N-((6-methylpyridin-2-yl)methyl)-4-morpholinopyridin-2-amine | CHEMBL567112
Type:
Small organic molecule
Emp. Form.:
C23H28FN5OS2
Mol. Mass.:
473.63
SMILES:
CCc1sc(SCc2cc(cc(NCc3cccc(C)n3)n2)N2CCOCC2)nc1CF
: