Target
Neuropeptide Y receptor type 1
Ligand
BDBM50301199
Substrate
Meas. Tech.
ChEMBL_598772 (CHEMBL1042012)
IC50
10±n/a nM
Citation
 Kameda, MAndo, MNakama, CKobayashi, KKawamoto, HIto, SSuzuki, TTani, TOzaki, STokita, SSato, N Synthesis and evaluation of a series of 2,4-diaminopyridine derivatives as potential positron emission tomography tracers for neuropeptide Y Y1 receptors. Bioorg Med Chem Lett 19:5124-7 (2009)  
Target
Name:
Neuropeptide Y receptor type 1
Synonyms:
NPY-Y1 NPY1R NPYR neuropeptide Y receptor Y1
Type:
Enzyme Catalytic Domain
Mol. Mass.:
44399.07
Organism:
Homo sapiens (Human)
Description:
NPY-Y1 NPY1R HUMAN::P25929
Residue:
384
  
Inhibitor
Name:
BDBM50301199
Synonyms:
6-((4,5-dimethyloxazol-2-ylthio)methyl)-N-((6-((2-fluoroethoxy)methyl)pyridin-2-yl)methyl)-4-morpholinopyridin-2-amine | CHEMBL566664
Type:
Small organic molecule
Emp. Form.:
C24H30FN5O3S
Mol. Mass.:
487.59
SMILES:
Cc1nc(SCc2cc(cc(NCc3cccc(COCCF)n3)n2)N2CCOCC2)oc1C
: