Target
Neuropeptide Y receptor type 1
Ligand
BDBM50301203
Substrate
Meas. Tech.
ChEMBL_598772 (CHEMBL1042012)
IC50
0.27±n/a nM
Citation
 Kameda, MAndo, MNakama, CKobayashi, KKawamoto, HIto, SSuzuki, TTani, TOzaki, STokita, SSato, N Synthesis and evaluation of a series of 2,4-diaminopyridine derivatives as potential positron emission tomography tracers for neuropeptide Y Y1 receptors. Bioorg Med Chem Lett 19:5124-7 (2009)  
Target
Name:
Neuropeptide Y receptor type 1
Synonyms:
NPY-Y1 NPY1R NPYR neuropeptide Y receptor Y1
Type:
Enzyme Catalytic Domain
Mol. Mass.:
44399.07
Organism:
Homo sapiens (Human)
Description:
NPY-Y1 NPY1R HUMAN::P25929
Residue:
384
  
Inhibitor
Name:
BDBM50301203
Synonyms:
6-((4,5-dimethyloxazol-2-ylthio)methyl)-N-((6-fluoropyridin-2-yl)methyl)-4-thiomorpholinopyridin-2-amine | CHEMBL566020
Type:
Small organic molecule
Emp. Form.:
C21H24FN5OS2
Mol. Mass.:
445.577
SMILES:
Cc1nc(SCc2cc(cc(NCc3cccc(F)n3)n2)N2CCSCC2)oc1C
: