Target
Neuropeptide Y receptor type 1
Ligand
BDBM50301206
Substrate
Meas. Tech.
ChEMBL_598772 (CHEMBL1042012)
IC50
1.7±n/a nM
Citation
 Kameda, MAndo, MNakama, CKobayashi, KKawamoto, HIto, SSuzuki, TTani, TOzaki, STokita, SSato, N Synthesis and evaluation of a series of 2,4-diaminopyridine derivatives as potential positron emission tomography tracers for neuropeptide Y Y1 receptors. Bioorg Med Chem Lett 19:5124-7 (2009)  
Target
Name:
Neuropeptide Y receptor type 1
Synonyms:
NPY-Y1 NPY1R NPYR neuropeptide Y receptor Y1
Type:
Enzyme Catalytic Domain
Mol. Mass.:
44399.07
Organism:
Homo sapiens (Human)
Description:
NPY-Y1 NPY1R HUMAN::P25929
Residue:
384
  
Inhibitor
Name:
BDBM50301206
Synonyms:
CHEMBL566889 | [6-(4,5-Dimethyl-oxazol-2-ylsulfanylmethyl)-4-(1,1-dioxo-1lambda*6*-thiomorpholin-4-yl)-pyridin-2-yl]-(6-methyl-pyridin-2-ylmethyl)-amine
Type:
Small organic molecule
Emp. Form.:
C22H27N5O3S2
Mol. Mass.:
473.611
SMILES:
Cc1nc(SCc2cc(cc(NCc3cccc(C)n3)n2)N2CCS(=O)(=O)CC2)oc1C
: