Target
Neuropeptide Y receptor type 1
Ligand
BDBM50301208
Substrate
Meas. Tech.
ChEMBL_598772 (CHEMBL1042012)
IC50
0.46±n/a nM
Citation
 Kameda, MAndo, MNakama, CKobayashi, KKawamoto, HIto, SSuzuki, TTani, TOzaki, STokita, SSato, N Synthesis and evaluation of a series of 2,4-diaminopyridine derivatives as potential positron emission tomography tracers for neuropeptide Y Y1 receptors. Bioorg Med Chem Lett 19:5124-7 (2009)  
Target
Name:
Neuropeptide Y receptor type 1
Synonyms:
NPY-Y1 NPY1R NPYR neuropeptide Y receptor Y1
Type:
Enzyme Catalytic Domain
Mol. Mass.:
44399.07
Organism:
Homo sapiens (Human)
Description:
NPY-Y1 NPY1R HUMAN::P25929
Residue:
384
  
Inhibitor
Name:
BDBM50301208
Synonyms:
CHEMBL566040 | N-((6-methylpyridin-2-yl)methyl)-4-morpholino-6-((4,5,6,7-tetrahydrobenzo[d]oxazol-2-ylthio)methyl)pyridin-2-amine
Type:
Small organic molecule
Emp. Form.:
C24H29N5O2S
Mol. Mass.:
451.584
SMILES:
Cc1cccc(CNc2cc(cc(CSc3nc4CCCCc4o3)n2)N2CCOCC2)n1
: