Target
C-X-C chemokine receptor type 3
Ligand
BDBM50301328
Substrate
Meas. Tech.
ChEMBL_599488 (CHEMBL1049024)
Ki
86±n/a nM
Citation
 McGuinness, BFCarroll, CDZawacki, LGDong, GYang, CHobbs, DWJacob-Samuel, BHall, JWJenh, CHKozlowski, JAAnilkumar, GNRosenblum, SB Novel CXCR3 antagonists with a piperazinyl-piperidine core. Bioorg Med Chem Lett 19:5205-8 (2009)  
Target
Name:
C-X-C chemokine receptor type 3
Synonyms:
AAO92295.1 C-X-C chemokine receptor type 3 (CXCR3) CXCR3 CXCR3_HUMAN chemokine (C-X-C motif) receptor 3
Type:
Enzyme Catalytic Domain
Mol. Mass.:
40665.65
Organism:
Homo sapiens (Human)
Description:
Residue:
368
  
Inhibitor
Name:
BDBM50301328
Synonyms:
(R)-5-chloro-6-(4-(1-(4-chlorobenzyl)piperidin-4-yl)-3-methylpiperazin-1-yl)-N-(3,4-dichlorobenzyl)nicotinamide | CHEMBL571377
Type:
Small organic molecule
Emp. Form.:
C30H33Cl4N5O
Mol. Mass.:
621.428
SMILES:
C[C@@H]1CN(CCN1C1CCN(Cc2ccc(Cl)cc2)CC1)c1ncc(cc1Cl)C(=O)NCc1ccc(Cl)c(Cl)c1
: