Target
C-X-C chemokine receptor type 3
Ligand
BDBM50301332
Substrate
Meas. Tech.
ChEMBL_599488 (CHEMBL1049024)
Ki
4500±n/a nM
Citation
 McGuinness, BFCarroll, CDZawacki, LGDong, GYang, CHobbs, DWJacob-Samuel, BHall, JWJenh, CHKozlowski, JAAnilkumar, GNRosenblum, SB Novel CXCR3 antagonists with a piperazinyl-piperidine core. Bioorg Med Chem Lett 19:5205-8 (2009)  
Target
Name:
C-X-C chemokine receptor type 3
Synonyms:
AAO92295.1 C-X-C chemokine receptor type 3 (CXCR3) CXCR3 CXCR3_HUMAN chemokine (C-X-C motif) receptor 3
Type:
Enzyme Catalytic Domain
Mol. Mass.:
40665.65
Organism:
Homo sapiens (Human)
Description:
Residue:
368
  
Inhibitor
Name:
BDBM50301332
Synonyms:
5-chloro-6-(4-(4-(4-chlorobenzyl)piperazin-1-yl)piperidin-1-yl)-N-(3,4-dichlorobenzyl)nicotinamide | CHEMBL570509
Type:
Small organic molecule
Emp. Form.:
C29H31Cl4N5O
Mol. Mass.:
607.401
SMILES:
Clc1ccc(CN2CCN(CC2)C2CCN(CC2)c2ncc(cc2Cl)C(=O)NCc2ccc(Cl)c(Cl)c2)cc1
: