Target
C-X-C chemokine receptor type 3
Ligand
BDBM50301334
Substrate
Meas. Tech.
ChEMBL_599488 (CHEMBL1049024)
Ki
2000±n/a nM
Citation
 McGuinness, BFCarroll, CDZawacki, LGDong, GYang, CHobbs, DWJacob-Samuel, BHall, JWJenh, CHKozlowski, JAAnilkumar, GNRosenblum, SB Novel CXCR3 antagonists with a piperazinyl-piperidine core. Bioorg Med Chem Lett 19:5205-8 (2009)  
Target
Name:
C-X-C chemokine receptor type 3
Synonyms:
AAO92295.1 C-X-C chemokine receptor type 3 (CXCR3) CXCR3 CXCR3_HUMAN chemokine (C-X-C motif) receptor 3
Type:
Enzyme Catalytic Domain
Mol. Mass.:
40665.65
Organism:
Homo sapiens (Human)
Description:
Residue:
368
  
Inhibitor
Name:
BDBM50301334
Synonyms:
5-chloro-6-(4-(3-((4-chlorophenyl)(methyl)amino)propyl)piperazin-1-yl)-N-(2-phenoxyethyl)nicotinamide | CHEMBL569336
Type:
Small organic molecule
Emp. Form.:
C28H33Cl2N5O2
Mol. Mass.:
542.5
SMILES:
CN(CCCN1CCN(CC1)c1ncc(cc1Cl)C(=O)NCCOc1ccccc1)c1ccc(Cl)cc1
: