Target
C-X-C chemokine receptor type 3
Ligand
BDBM50301339
Substrate
Meas. Tech.
ChEMBL_599488 (CHEMBL1049024)
Ki
320±n/a nM
Citation
 McGuinness, BFCarroll, CDZawacki, LGDong, GYang, CHobbs, DWJacob-Samuel, BHall, JWJenh, CHKozlowski, JAAnilkumar, GNRosenblum, SB Novel CXCR3 antagonists with a piperazinyl-piperidine core. Bioorg Med Chem Lett 19:5205-8 (2009)  
Target
Name:
C-X-C chemokine receptor type 3
Synonyms:
AAO92295.1 C-X-C chemokine receptor type 3 (CXCR3) CXCR3 CXCR3_HUMAN chemokine (C-X-C motif) receptor 3
Type:
Enzyme Catalytic Domain
Mol. Mass.:
40665.65
Organism:
Homo sapiens (Human)
Description:
Residue:
368
  
Inhibitor
Name:
BDBM50301339
Synonyms:
5-chloro-6-(4-(1-(4-cyanobenzoyl)piperidin-4-yl)piperazin-1-yl)-N-(2-phenoxyethyl)nicotinamide | CHEMBL570356
Type:
Small organic molecule
Emp. Form.:
C31H33ClN6O3
Mol. Mass.:
573.085
SMILES:
Clc1cc(cnc1N1CCN(CC1)C1CCN(CC1)C(=O)c1ccc(cc1)C#N)C(=O)NCCOc1ccccc1
: