Target
C-X-C chemokine receptor type 3
Ligand
BDBM50301341
Substrate
Meas. Tech.
ChEMBL_599488 (CHEMBL1049024)
Ki
85±n/a nM
Citation
 McGuinness, BFCarroll, CDZawacki, LGDong, GYang, CHobbs, DWJacob-Samuel, BHall, JWJenh, CHKozlowski, JAAnilkumar, GNRosenblum, SB Novel CXCR3 antagonists with a piperazinyl-piperidine core. Bioorg Med Chem Lett 19:5205-8 (2009)  
Target
Name:
C-X-C chemokine receptor type 3
Synonyms:
AAO92295.1 C-X-C chemokine receptor type 3 (CXCR3) CXCR3 CXCR3_HUMAN chemokine (C-X-C motif) receptor 3
Type:
Enzyme Catalytic Domain
Mol. Mass.:
40665.65
Organism:
Homo sapiens (Human)
Description:
Residue:
368
  
Inhibitor
Name:
BDBM50301341
Synonyms:
6-(4-(1-(4-bromobenzyl)piperidin-4-yl)piperazin-1-yl)-5-chloro-N-(2-phenoxyethyl)nicotinamide | CHEMBL578546
Type:
Small organic molecule
Emp. Form.:
C30H35BrClN5O2
Mol. Mass.:
612.988
SMILES:
Clc1cc(cnc1N1CCN(CC1)C1CCN(Cc2ccc(Br)cc2)CC1)C(=O)NCCOc1ccccc1
: