Target
C-X-C chemokine receptor type 3
Ligand
BDBM50301350
Substrate
Meas. Tech.
ChEMBL_599488 (CHEMBL1049024)
Ki
410±n/a nM
Citation
 McGuinness, BFCarroll, CDZawacki, LGDong, GYang, CHobbs, DWJacob-Samuel, BHall, JWJenh, CHKozlowski, JAAnilkumar, GNRosenblum, SB Novel CXCR3 antagonists with a piperazinyl-piperidine core. Bioorg Med Chem Lett 19:5205-8 (2009)  
Target
Name:
C-X-C chemokine receptor type 3
Synonyms:
AAO92295.1 C-X-C chemokine receptor type 3 (CXCR3) CXCR3 CXCR3_HUMAN chemokine (C-X-C motif) receptor 3
Type:
Enzyme Catalytic Domain
Mol. Mass.:
40665.65
Organism:
Homo sapiens (Human)
Description:
Residue:
368
  
Inhibitor
Name:
BDBM50301350
Synonyms:
5-chloro-6-(4-(1-(4-chlorobenzyl)piperidin-4-yl)piperazin-1-yl)-N-(3-methoxybenzyl)nicotinamide | CHEMBL565968
Type:
Small organic molecule
Emp. Form.:
C30H35Cl2N5O2
Mol. Mass.:
568.537
SMILES:
COc1cccc(CNC(=O)c2cnc(N3CCN(CC3)C3CCN(Cc4ccc(Cl)cc4)CC3)c(Cl)c2)c1
: