Target
C-X-C chemokine receptor type 3
Ligand
BDBM50301352
Substrate
Meas. Tech.
ChEMBL_599488 (CHEMBL1049024)
Ki
1900±n/a nM
Citation
 McGuinness, BFCarroll, CDZawacki, LGDong, GYang, CHobbs, DWJacob-Samuel, BHall, JWJenh, CHKozlowski, JAAnilkumar, GNRosenblum, SB Novel CXCR3 antagonists with a piperazinyl-piperidine core. Bioorg Med Chem Lett 19:5205-8 (2009)  
Target
Name:
C-X-C chemokine receptor type 3
Synonyms:
AAO92295.1 C-X-C chemokine receptor type 3 (CXCR3) CXCR3 CXCR3_HUMAN chemokine (C-X-C motif) receptor 3
Type:
Enzyme Catalytic Domain
Mol. Mass.:
40665.65
Organism:
Homo sapiens (Human)
Description:
Residue:
368
  
Inhibitor
Name:
BDBM50301352
Synonyms:
CHEMBL584079 | N-(5-chloro-6-(4-(1-(4-chlorobenzyl)piperidin-4-yl)piperazin-1-yl)pyridin-3-yl)-2-(3,4-dichlorophenyl)acetamide
Type:
Small organic molecule
Emp. Form.:
C29H31Cl4N5O
Mol. Mass.:
607.401
SMILES:
Clc1ccc(CN2CCC(CC2)N2CCN(CC2)c2ncc(NC(=O)Cc3ccc(Cl)c(Cl)c3)cc2Cl)cc1
: