Target
C-X-C chemokine receptor type 3
Ligand
BDBM50301353
Substrate
Meas. Tech.
ChEMBL_599488 (CHEMBL1049024)
Ki
>50000±n/a nM
Citation
 McGuinness, BFCarroll, CDZawacki, LGDong, GYang, CHobbs, DWJacob-Samuel, BHall, JWJenh, CHKozlowski, JAAnilkumar, GNRosenblum, SB Novel CXCR3 antagonists with a piperazinyl-piperidine core. Bioorg Med Chem Lett 19:5205-8 (2009)  
Target
Name:
C-X-C chemokine receptor type 3
Synonyms:
AAO92295.1 C-X-C chemokine receptor type 3 (CXCR3) CXCR3 CXCR3_HUMAN chemokine (C-X-C motif) receptor 3
Type:
Enzyme Catalytic Domain
Mol. Mass.:
40665.65
Organism:
Homo sapiens (Human)
Description:
Residue:
368
  
Inhibitor
Name:
BDBM50301353
Synonyms:
1-(5-chloro-6-(4-(1-(4-chlorobenzyl)piperidin-4-yl)piperazin-1-yl)pyridin-3-yl)-3-(3,4-dichlorophenyl)urea | CHEMBL568684
Type:
Small organic molecule
Emp. Form.:
C28H30Cl4N6O
Mol. Mass.:
608.389
SMILES:
Clc1ccc(CN2CCC(CC2)N2CCN(CC2)c2ncc(NC(=O)Nc3ccc(Cl)c(Cl)c3)cc2Cl)cc1
: