Target
P2Y purinoceptor 12
Ligand
BDBM50302452
Substrate
Meas. Tech.
ChEMBL_597610 (CHEMBL1050573)
Ki
31±n/a nM
Citation
 Kortum, SWLachance, RMSchweitzer, BAYalamanchili, GRahman, HEnnis, MDHuff, RMTenBrink, RE Thienopyrimidine-based P2Y12 platelet aggregation inhibitors. Bioorg Med Chem Lett 19:5919-23 (2009)  
Target
Name:
P2Y purinoceptor 12
Synonyms:
ADP-glucose receptor HORK3 P2T(AC) P2Y(AC) P2Y(cyc) P2Y12 platelet ADP receptor Purinergic receptor P2Y12 | SP1999
Type:
Enzyme
Mol. Mass.:
39458.48
Organism:
Homo sapiens (Human)
Description:
Q9H244
Residue:
342
  
Inhibitor
Name:
BDBM50302452
Synonyms:
(2S,4S)-1-(4-(4-(biphenylcarbonyl)piperazin-1-yl)-6-ethylthieno[2,3-d]pyrimidin-2-yl)-4-hydroxypyrrolidine-2-carboxylic acid | CHEMBL568334
Type:
Small organic molecule
Emp. Form.:
C30H31N5O4S
Mol. Mass.:
557.663
SMILES:
CCc1cc2c(nc(nc2s1)N1C[C@@H](O)C[C@H]1C(O)=O)N1CCN(CC1)C(=O)c1ccc(cc1)-c1ccccc1
: