Target
P2Y purinoceptor 12
Ligand
BDBM50302451
Substrate
Meas. Tech.
ChEMBL_597609 (CHEMBL1050572)
Ki
27±n/a nM
Citation
 Kortum, SWLachance, RMSchweitzer, BAYalamanchili, GRahman, HEnnis, MDHuff, RMTenBrink, RE Thienopyrimidine-based P2Y12 platelet aggregation inhibitors. Bioorg Med Chem Lett 19:5919-23 (2009)  
Target
Name:
P2Y purinoceptor 12
Synonyms:
ADP-glucose receptor HORK3 P2T(AC) P2Y(AC) P2Y(cyc) P2Y12 platelet ADP receptor Purinergic receptor P2Y12 | SP1999
Type:
Enzyme
Mol. Mass.:
39458.48
Organism:
Homo sapiens (Human)
Description:
Q9H244
Residue:
342
  
Inhibitor
Name:
BDBM50302451
Synonyms:
CHEMBL568566 | biphenyl-4-yl(4-(6-ethyl-2-(3-hydroxyazetidin-1-yl)thieno[2,3-d]pyrimidin-4-yl)piperazin-1-yl)methanone
Type:
Small organic molecule
Emp. Form.:
C28H29N5O2S
Mol. Mass.:
499.627
SMILES:
CCc1cc2c(nc(nc2s1)N1CC(O)C1)N1CCN(CC1)C(=O)c1ccc(cc1)-c1ccccc1
: