Target
P2Y purinoceptor 12
Ligand
BDBM50302691
Substrate
Meas. Tech.
ChEMBL_595036 (CHEMBL1042521)
Ki
0.7±n/a nM
Citation
 Parlow, JJBurney, MWCase, BLGirard, TJHall, KAHiebsch, RRHuff, RMLachance, RMMischke, DARapp, SRWoerndle, RSEnnis, MD Piperazinyl-glutamate-pyrimidines as potent P2Y12 antagonists for inhibition of platelet aggregation. Bioorg Med Chem Lett 19:6148-56 (2009)  
Target
Name:
P2Y purinoceptor 12
Synonyms:
ADP-glucose receptor HORK3 P2T(AC) P2Y(AC) P2Y(cyc) P2Y12 platelet ADP receptor Purinergic receptor P2Y12 | SP1999
Type:
Enzyme
Mol. Mass.:
39458.48
Organism:
Homo sapiens (Human)
Description:
Q9H244
Residue:
342
  
Inhibitor
Name:
BDBM50302691
Synonyms:
(S)-5-(4-(butoxycarbonyl)piperazin-1-yl)-5-oxo-4-(2-phenyl-6-(4-(pyrrolidine-1-carbonyl)piperidin-1-yl)pyrimidine-4-carboxamido)pentanoic acid | CHEMBL567133
Type:
Small organic molecule
Emp. Form.:
C35H47N7O7
Mol. Mass.:
677.7904
SMILES:
CCCCOC(=O)N1CCN(CC1)C(=O)[C@H](CCC(O)=O)NC(=O)c1cc(nc(n1)-c1ccccc1)N1CCC(CC1)C(=O)N1CCCC1
: