Target
Dickkopf-related protein 1
Ligand
BDBM50303038
Substrate
Meas. Tech.
ChEMBL_597250 (CHEMBL1043427)
EC50
1000±n/a nM
Citation
 Pelletier, JCLundquist, JTGilbert, AMAlon, NBex, FJBhat, BMBursavich, MGColeburn, VEFelix, LAGreen, DMGreen, PHauze, DBKharode, YPLam, HSLockhead, SRMagolda, RLMatteo, JJMehlmann, JFMilligan, CMurrills, RJPirrello, JSelim, SSharp, MCUnwalla, RJVera, MDWrobel, JEYaworsky, PBodine, PV (1-(4-(Naphthalen-2-yl)pyrimidin-2-yl)piperidin-4-yl)methanamine: a wingless beta-catenin agonist that increases bone formation rate. J Med Chem 52:6962-5 (2009)  
Target
Name:
Dickkopf-related protein 1
Synonyms:
DKK1 | DKK1_HUMAN
Type:
PROTEIN
Mol. Mass.:
28687.93
Organism:
Homo sapiens (Human)
Description:
ChEMBL_597250
Residue:
266
  
Inhibitor
Name:
BDBM50303038
Synonyms:
1-(4-(naphthalen-2-yl)pyrimidin-2-yl)piperidin-4-amine | CHEMBL570666
Type:
Small organic molecule
Emp. Form.:
C19H20N4
Mol. Mass.:
304.3889
SMILES:
NC1CCN(CC1)c1nccc(n1)-c1ccc2ccccc2c1
: