Target
Dickkopf-related protein 1
Ligand
BDBM50303039
Substrate
Meas. Tech.
ChEMBL_597250 (CHEMBL1043427)
EC50
1000±n/a nM
Citation
 Pelletier, JCLundquist, JTGilbert, AMAlon, NBex, FJBhat, BMBursavich, MGColeburn, VEFelix, LAGreen, DMGreen, PHauze, DBKharode, YPLam, HSLockhead, SRMagolda, RLMatteo, JJMehlmann, JFMilligan, CMurrills, RJPirrello, JSelim, SSharp, MCUnwalla, RJVera, MDWrobel, JEYaworsky, PBodine, PV (1-(4-(Naphthalen-2-yl)pyrimidin-2-yl)piperidin-4-yl)methanamine: a wingless beta-catenin agonist that increases bone formation rate. J Med Chem 52:6962-5 (2009)  
Target
Name:
Dickkopf-related protein 1
Synonyms:
DKK1 | DKK1_HUMAN
Type:
PROTEIN
Mol. Mass.:
28687.93
Organism:
Homo sapiens (Human)
Description:
ChEMBL_597250
Residue:
266
  
Inhibitor
Name:
BDBM50303039
Synonyms:
4-(4-(naphthalen-2-yl)pyrimidin-2-ylamino)benzenesulfonamide | CHEMBL569046
Type:
Small organic molecule
Emp. Form.:
C20H16N4O2S
Mol. Mass.:
376.432
SMILES:
NS(=O)(=O)c1ccc(Nc2nccc(n2)-c2ccc3ccccc3c2)cc1
: