Target
Glycogen synthase kinase-3 beta
Ligand
BDBM50303037
Substrate
Meas. Tech.
ChEMBL_597251 (CHEMBL1043428)
IC50
>100000±n/a nM
Citation
 Pelletier, JCLundquist, JTGilbert, AMAlon, NBex, FJBhat, BMBursavich, MGColeburn, VEFelix, LAGreen, DMGreen, PHauze, DBKharode, YPLam, HSLockhead, SRMagolda, RLMatteo, JJMehlmann, JFMilligan, CMurrills, RJPirrello, JSelim, SSharp, MCUnwalla, RJVera, MDWrobel, JEYaworsky, PBodine, PV (1-(4-(Naphthalen-2-yl)pyrimidin-2-yl)piperidin-4-yl)methanamine: a wingless beta-catenin agonist that increases bone formation rate. J Med Chem 52:6962-5 (2009)  
Target
Name:
Glycogen synthase kinase-3 beta
Synonyms:
GSK-3 beta GSK3B Glycogen synthase kinase 3 beta (GSK3B) Glycogen synthase kinase-3 beta (GSK-3B) Glycogen synthase kinase-3 beta (GSK3B) Glycogen synthase kinase-3beta (GSK3B) | Serine/threonine-protein kinase GSK3B
Type:
Enzyme
Mol. Mass.:
46756.38
Organism:
Homo sapiens (Human)
Description:
P49841
Residue:
420
  
Inhibitor
Name:
BDBM50303037
Synonyms:
(1-(4-(naphthalen-2-yl)pyrimidin-2-yl)piperidin-4-yl)methanamine | CHEMBL570667
Type:
Small organic molecule
Emp. Form.:
C20H22N4
Mol. Mass.:
318.4155
SMILES:
NCC1CCN(CC1)c1nccc(n1)-c1ccc2ccccc2c1
: