Target
Dual specificity protein phosphatase 1
Ligand
BDBM28879
Substrate
Meas. Tech.
ChEMBL_595101 (CHEMBL1047961)
IC50
460±n/a nM
Citation
 Wu, SVossius, SRahmouni, SMiletic, AVVang, TVazquez-Rodriguez, JCerignoli, FArimura, YWilliams, SHayes, TMoutschen, MVasile, SPellecchia, MMustelin, TTautz, L Multidentate small-molecule inhibitors of vaccinia H1-related (VHR) phosphatase decrease proliferation of cervix cancer cells. J Med Chem 52:6716-23 (2009)  
Target
Name:
Dual specificity protein phosphatase 1
Synonyms:
CL100 DUSP1 MAP kinase phosphatase 1 MKP1 Protein-tyrosine phosphatase CL100 | VH1
Type:
Protein phosphatase
Mol. Mass.:
39301.48
Organism:
Homo sapiens (Human)
Description:
gi_4758204
Residue:
367
  
Inhibitor
Name:
BDBM28879
Synonyms:
2-[(5Z)-5-[(3-{4-[(4-chlorophenyl)methoxy]phenyl}-1-phenyl-1H-pyrazol-4-yl)methylidene]-4-oxo-2-sulfanylidene-1,3-thiazolidin-3-yl]ethane-1-sulfonic acid rhodanine derivative, 38
Type:
Small organic molecule
Emp. Form.:
C28H22ClN3O5S3
Mol. Mass.:
612.139
SMILES:
OS(=O)(=O)CCN1C(=S)S\C(=C/c2cn(nc2-c2ccc(OCc3ccc(Cl)cc3)cc2)-c2ccccc2)C1=O
: