Target
Serine/threonine-protein kinase mTOR
Ligand
BDBM50303280
Substrate
Meas. Tech.
ChEMBL_595396 (CHEMBL1039195)
IC50
0.2±n/a nM
Citation
 Richard, DJVerheijen, JCCurran, KKaplan, JToral-Barza, LHollander, ILucas, JYu, KZask, A Incorporation of water-solubilizing groups in pyrazolopyrimidine mTOR inhibitors: discovery of highly potent and selective analogs with improved human microsomal stability. Bioorg Med Chem Lett 19:6830-5 (2009)  
Target
Name:
Serine/threonine-protein kinase mTOR
Synonyms:
FK506-binding protein 12-rapamycin complex-associated protein 1 FRAP FRAP1 MTOR Mammalian Target of Rapamycin (mTOR) RAFT1 Rapamycin and FKBP12 target 1 Serine/threonine-protein kinase (mTOR) | mTORC2
Type:
Rapamycin target protein
Mol. Mass.:
288917.12
Organism:
Homo sapiens (Human)
Description:
P42345
Residue:
2549
  
Inhibitor
Name:
BDBM50303280
Synonyms:
4-(3-(4-(4-(8-oxa-3-azabicyclo[3.2.1]octan-3-yl)-1-ethyl-1H-pyrazolo[3,4-d]pyrimidin-6-yl)phenyl)ureido)-N-(pyrrolidin-1-yl)benzamide | CHEMBL576090
Type:
Small organic molecule
Emp. Form.:
C31H35N9O3
Mol. Mass.:
581.6681
SMILES:
CCn1ncc2c(nc(nc12)-c1ccc(NC(=O)Nc2ccc(cc2)C(=O)NN2CCCC2)cc1)N1CC2CCC(C1)O2
: