Target
Cannabinoid receptor 2
Ligand
BDBM50303527
Substrate
Meas. Tech.
ChEMBL_596090 (CHEMBL1040878)
EC50
6±n/a nM
Citation
 Frost, JMDart, MJTietje, KRGarrison, TRGrayson, GKDaza, AVEl-Kouhen, OFYao, BBHsieh, GCPai, MZhu, CZChandran, PMeyer, MD Indol-3-ylcycloalkyl ketones: effects of N1 substituted indole side chain variations on CB(2) cannabinoid receptor activity. J Med Chem 53:295-315 (2010)  
Target
Name:
Cannabinoid receptor 2
Synonyms:
CANNABINOID CB2 CB2 CB2B CNR2_HUMAN Cannabinoid CB2 receptor Cannabinoid receptor 2 (CB2R) | hCB2
Type:
G Protein-Coupled Receptor (GPCR)
Mol. Mass.:
39690.94
Organism:
Homo sapiens (Human)
Description:
P34972
Residue:
360
  
Inhibitor
Name:
BDBM50303527
Synonyms:
(2,2,3,3-Tetramethylcyclopropyl)(1-(4,4,4-trifluorobutyl)-1Hindol-3-yl)methanone | CHEMBL569082
Type:
Small organic molecule
Emp. Form.:
C20H24F3NO
Mol. Mass.:
351.4059
SMILES:
CC1(C)C(C(=O)c2cn(CCCC(F)(F)F)c3ccccc23)C1(C)C
: