Target
Mu-type opioid receptor
Ligand
BDBM50037134
Substrate
Meas. Tech.
ChEMBL_594992 (CHEMBL1039850)
Kd
0.220000±n/a nM
Citation
 Hsin, LWChang, LTRothman, RBDersch, CMFishback, JAMatsumoto, RR Synthesis and opioid activity of enantiomeric N-substituted 2,3,4,4a,5,6,7,7a-octahydro-1H-benzofuro[3,2-e]isoquinolines. J Med Chem 53:1392-6 (2010)  
Target
Name:
Mu-type opioid receptor
Synonyms:
M-OR-1 MOR-1 MUOR1 Mu opiate receptor OPRM1 hMOP | mu-type opioid receptor isoform MOR-1
Type:
G Protein-Coupled Receptor (GPCR)
Mol. Mass.:
44789.51
Organism:
Homo sapiens (Human)
Description:
P35372
Residue:
400
  
Inhibitor
Name:
BDBM50037134
Synonyms:
(+)-trans-3-Cyclopropylmethyl-2,3,4,4aalpha,5,6,7,7aalpha-octahydro-1H-benzo[4,5]furo[3,2-e]isoquinolin-9-ol (-)-trans-3-Cyclopropylmethyl-2,3,4,4aalpha,5,6,7,7aalpha-octahydro-1H-benzo[4,5]furo[3,2-e]isoquinolin-9-ol CHEMBL104042
Type:
Small organic molecule
Emp. Form.:
C19H25NO2
Mol. Mass.:
299.4073
SMILES:
Oc1cccc2c1O[C@H]1CCC[C@H]3CN(CC4CC4)CC[C@]213
: