Target
Cannabinoid receptor 2
Ligand
BDBM50304920
Substrate
Meas. Tech.
ChEMBL_606629 (CHEMBL1071856)
EC50
1700±n/a nM
Citation
 Sellitto, ILe Bourdonnec, BWorm, KGoodman, ASavolainen, MAChu, GHAjello, CWSaeui, CTLeister, LKCassel, JADehaven, RNLabuda, CJKoblish, MLittle, PJBrogdon, BLSmith, SADolle, RE Novel sulfamoyl benzamides as selective CB(2) agonists with improved in vitro metabolic stability. Bioorg Med Chem Lett 20:387-91 (2010)  
Target
Name:
Cannabinoid receptor 2
Synonyms:
CANNABINOID CB2 CB2 Cannabinoid CB2 receptor Cnr2 | rCB2
Type:
Enzyme
Mol. Mass.:
39366.68
Organism:
Rattus norvegicus (Rat)
Description:
Q9QZN9
Residue:
360
  
Inhibitor
Name:
BDBM50304920
Synonyms:
2,2-dimethyl-N-(7-(morpholinosulfonyl)-2,3-dihydro-1H-inden-5-yl)butanamide | CHEMBL603736
Type:
Small organic molecule
Emp. Form.:
C19H28N2O4S
Mol. Mass.:
380.502
SMILES:
CCC(C)(C)C(=O)Nc1cc2CCCc2c(c1)S(=O)(=O)N1CCOCC1
: