Target
Amine oxidase [flavin-containing] A
Ligand
BDBM50305216
Substrate
Meas. Tech.
ChEMBL_603299 (CHEMBL1049523)
Ki
360±n/a nM
Citation
 Sahoo, AYabanoglu, SSinha, BNUcar, GBasu, AJayaprakash, V Towards development of selective and reversible pyrazoline based MAO-inhibitors: Synthesis, biological evaluation and docking studies. Bioorg Med Chem Lett 20:132-6 (2010)  
Target
Name:
Amine oxidase [flavin-containing] A
Synonyms:
AOFA_RAT Amine oxidase [flavin-containing] A Monoamine Oxidase Type A (MAO-A) Monoamine oxidase A (MAO-A) Monoamine oxidase type A (MAOA)
Type:
Enzyme
Mol. Mass.:
59515.21
Organism:
Rattus norvegicus (rat)
Description:
Residue:
526
  
Inhibitor
Name:
BDBM50305216
Synonyms:
3,5-bis-(2-hydroxyphenyl)-1N-(4-methyl benzenesulphonyl)-4,5-dihydro-1H-pyrazole | CHEMBL590369
Type:
Small organic molecule
Emp. Form.:
C22H20N2O4S
Mol. Mass.:
408.47
SMILES:
Cc1ccc(cc1)S(=O)(=O)N1N=C(CC1c1ccccc1O)c1ccccc1O
: