Target
Cathepsin E
Ligand
BDBM50305533
Substrate
Meas. Tech.
ChEMBL_604246 (CHEMBL1050391)
IC50
8±n/a nM
Citation
 Lerchner, AMachauer, RBetschart, CVeenstra, SRueeger, HMcCarthy, CTintelnot-Blomley, MJaton, ALRabe, SDesrayaud, SEnz, AStaufenbiel, MPaganetti, PRondeau, JMNeumann, U Macrocyclic BACE-1 inhibitors acutely reduce Abeta in brain after po application. Bioorg Med Chem Lett 20:603-7 (2010)  
Target
Name:
Cathepsin E
Synonyms:
3.4.23.34 CTSE Cathepsin E form II
Type:
Enzyme
Mol. Mass.:
43298.99
Organism:
Homo sapiens (Human)
Description:
P14091
Residue:
396
  
Inhibitor
Name:
BDBM50305533
Synonyms:
(S)-4-[(R)-1-Hydroxy-2-(3-isopropyl-benzylamino)-ethyl]-19-methyl-11,16-dioxa-3,18-diaza-tricyclo[15.3.1.1*6,10*]docosa-1(21),6(22),7,9,17,19-hexaen-2-one | CHEMBL589369
Type:
Small organic molecule
Emp. Form.:
C31H39N3O4
Mol. Mass.:
517.6591
SMILES:
CC(C)c1cccc(CNC[C@@H](O)[C@@H]2Cc3cccc(OCCCCOc4cc(cc(C)n4)C(=O)N2)c3)c1
: