Target
Cannabinoid receptor 1
Ligand
BDBM50306216
Substrate
Meas. Tech.
ChEMBL_606748 (CHEMBL1065338)
IC50
1.8±n/a nM
Citation
 Receveur, JMMurray, ALinget, JMNørregaard, PKCooper, MBjurling, ENielsen, PAHögberg, T Conversion of 4-cyanomethyl-pyrazole-3-carboxamides into CB1 antagonists with lowered propensity to pass the blood-brain-barrier. Bioorg Med Chem Lett 20:453-7 (2010)  
Target
Name:
Cannabinoid receptor 1
Synonyms:
CANN6 CB-R CNR CNR1_HUMAN Cannabinoid receptor Cannabinoid receptor 1 (brain)
Type:
G Protein-Coupled Receptor (GPCR)
Mol. Mass.:
52868.96
Organism:
Homo sapiens (Human)
Description:
P21554
Residue:
472
  
Inhibitor
Name:
BDBM50306216
Synonyms:
1-(2-chlorophenyl)-5-(4-chlorophenyl)-4-(2-(hydroxyamino)-2-iminoethyl)-N-(piperidin-1-yl)-1H-pyrazole-3-carboxamide | CHEMBL595017
Type:
Small organic molecule
Emp. Form.:
C23H24Cl2N6O2
Mol. Mass.:
487.382
SMILES:
ONC(=N)Cc1c(nn(c1-c1ccc(Cl)cc1)-c1ccccc1Cl)C(=O)NN1CCCCC1
: