Target
Cannabinoid receptor 1
Ligand
BDBM50306226
Substrate
Meas. Tech.
ChEMBL_606749 (CHEMBL1065339)
IC50
0.59±n/a nM
Citation
 Receveur, JMMurray, ALinget, JMNørregaard, PKCooper, MBjurling, ENielsen, PAHögberg, T Conversion of 4-cyanomethyl-pyrazole-3-carboxamides into CB1 antagonists with lowered propensity to pass the blood-brain-barrier. Bioorg Med Chem Lett 20:453-7 (2010)  
Target
Name:
Cannabinoid receptor 1
Synonyms:
CANN6 CB-R CNR CNR1_HUMAN Cannabinoid receptor Cannabinoid receptor 1 (brain)
Type:
G Protein-Coupled Receptor (GPCR)
Mol. Mass.:
52868.96
Organism:
Homo sapiens (Human)
Description:
P21554
Residue:
472
  
Inhibitor
Name:
BDBM50306226
Synonyms:
2-(1-(2-chlorophenyl)-5-(4-chlorophenyl)-3-(4-(pyrimidin-2-yl)piperidine-1-carbonyl)-1H-pyrazol-4-yl)acetimidamide | CHEMBL605721
Type:
Small organic molecule
Emp. Form.:
C27H25Cl2N7O
Mol. Mass.:
534.44
SMILES:
NC(=N)Cc1c(nn(c1-c1ccc(Cl)cc1)-c1ccccc1Cl)C(=O)N1CCC(CC1)c1ncccn1
: