Target
Cannabinoid receptor 1
Ligand
BDBM50306236
Substrate
Meas. Tech.
ChEMBL_606748 (CHEMBL1065338)
IC50
3.6±n/a nM
Citation
 Receveur, JMMurray, ALinget, JMNørregaard, PKCooper, MBjurling, ENielsen, PAHögberg, T Conversion of 4-cyanomethyl-pyrazole-3-carboxamides into CB1 antagonists with lowered propensity to pass the blood-brain-barrier. Bioorg Med Chem Lett 20:453-7 (2010)  
Target
Name:
Cannabinoid receptor 1
Synonyms:
CANN6 CB-R CNR CNR1_HUMAN Cannabinoid receptor Cannabinoid receptor 1 (brain)
Type:
G Protein-Coupled Receptor (GPCR)
Mol. Mass.:
52868.96
Organism:
Homo sapiens (Human)
Description:
P21554
Residue:
472
  
Inhibitor
Name:
BDBM50306236
Synonyms:
2-(1-(2-chlorophenyl)-5-(4-chlorophenyl)-3-(4-hydroxy-4-(pyridin-2-yl)piperidine-1-carbonyl)-1H-pyrazol-4-yl)acetamide | CHEMBL596166
Type:
Small organic molecule
Emp. Form.:
C28H25Cl2N5O3
Mol. Mass.:
550.436
SMILES:
NC(=O)Cc1c(nn(c1-c1ccc(Cl)cc1)-c1ccccc1Cl)C(=O)N1CCC(O)(CC1)c1ccccn1
: