Target
Cannabinoid receptor 1
Ligand
BDBM50306234
Substrate
Meas. Tech.
ChEMBL_607001 (CHEMBL1074629)
IC50
0.78±n/a nM
Citation
 Receveur, JMMurray, ALinget, JMNørregaard, PKCooper, MBjurling, ENielsen, PAHögberg, T Conversion of 4-cyanomethyl-pyrazole-3-carboxamides into CB1 antagonists with lowered propensity to pass the blood-brain-barrier. Bioorg Med Chem Lett 20:453-7 (2010)  
Target
Name:
Cannabinoid receptor 1
Synonyms:
CANN6 CB-R CNR CNR1_HUMAN Cannabinoid receptor Cannabinoid receptor 1 (brain)
Type:
G Protein-Coupled Receptor (GPCR)
Mol. Mass.:
52868.96
Organism:
Homo sapiens (Human)
Description:
P21554
Residue:
472
  
Inhibitor
Name:
BDBM50306234
Synonyms:
2-(1-(2-chlorophenyl)-5-(4-chlorophenyl)-3-(4-cyano-4-phenylpiperidine-1-carbonyl)-1H-pyrazol-4-yl)acetamide | CHEMBL594526
Type:
Small organic molecule
Emp. Form.:
C30H25Cl2N5O2
Mol. Mass.:
558.458
SMILES:
NC(=O)Cc1c(nn(c1-c1ccc(Cl)cc1)-c1ccccc1Cl)C(=O)N1CCC(CC1)(C#N)c1ccccc1
: