Target
Hypoxia-inducible factor 1-alpha
Ligand
BDBM50306569
Substrate
Meas. Tech.
ChEMBL_610892 (CHEMBL1065047)
IC50
>100000±n/a nM
Citation
 Shimizu, KMaruyama, MYasui, YMinegishi, HBan, HSNakamura, H Boron-containing phenoxyacetanilide derivatives as hypoxia-inducible factor (HIF)-1alpha inhibitors. Bioorg Med Chem Lett 20:1453-6 (2010)  
Target
Name:
Hypoxia-inducible factor 1-alpha
Synonyms:
BHLHE78 HIF-1-alpha, HIF-2-alpha HIF1A_HUMAN Hypoxia-inducible factor 1 alpha MOP1 von Hippel-Lindau disease tumor suppressor/Elongin-C/Elongin-B/HIF1A
Type:
Protein
Mol. Mass.:
92647.24
Organism:
Homo sapiens (Human)
Description:
Q16665
Residue:
826
  
Inhibitor
Name:
BDBM50306569
Synonyms:
4-hydroxy-3-(2-(p-tolyloxy)acetamido)phenylboronic acid | CHEMBL601703
Type:
Small organic molecule
Emp. Form.:
C15H16BNO5
Mol. Mass.:
301.102
SMILES:
Cc1ccc(OCC(=O)Nc2cc(ccc2O)B(O)O)cc1
: