Target
Amine oxidase [flavin-containing] A
Ligand
BDBM50306696
Substrate
Meas. Tech.
ChEMBL_611621 (CHEMBL1068958)
IC50
1770±n/a nM
Citation
 Strydom, BMalan, SFCastagnoli, NBergh, JJPetzer, JP Inhibition of monoamine oxidase by 8-benzyloxycaffeine analogues. Bioorg Med Chem 18:1018-28 (2010)  
Target
Name:
Amine oxidase [flavin-containing] A
Synonyms:
AOFA_HUMAN MAO-A Monoamine oxidase Monoamine oxidase type A (MAO A) Monoamine oxidase type A (MAOA)
Type:
Protein
Mol. Mass.:
59689.53
Organism:
Homo sapiens (Human)
Description:
P21397
Residue:
527
  
Inhibitor
Name:
BDBM50306696
Synonyms:
8-Benzyloxycaffeine cid_223566
Type:
Small organic molecule
Emp. Form.:
C15H16N4O3
Mol. Mass.:
300.3125
SMILES:
Cn1c(OCc2ccccc2)nc2n(C)c(=O)n(C)c(=O)c12
: