Target
Amine oxidase [flavin-containing] B
Ligand
BDBM50306696
Substrate
Meas. Tech.
ChEMBL_611622 (CHEMBL1068959)
IC50
1240±n/a nM
Citation
 Strydom, BMalan, SFCastagnoli, NBergh, JJPetzer, JP Inhibition of monoamine oxidase by 8-benzyloxycaffeine analogues. Bioorg Med Chem 18:1018-28 (2010)  
Target
Name:
Amine oxidase [flavin-containing] B
Synonyms:
AOFB_HUMAN MAOB Monoamine oxidase type B (MAO B) Monoamine oxidase type B (MAOB)
Type:
Protein
Mol. Mass.:
58768.76
Organism:
Homo sapiens (Human)
Description:
P27338
Residue:
520
  
Inhibitor
Name:
BDBM50306696
Synonyms:
8-Benzyloxycaffeine cid_223566
Type:
Small organic molecule
Emp. Form.:
C15H16N4O3
Mol. Mass.:
300.3125
SMILES:
Cn1c(OCc2ccccc2)nc2n(C)c(=O)n(C)c(=O)c12
: