Target
Prostaglandin E2 receptor EP3 subtype
Ligand
BDBM50307444
Substrate
Meas. Tech.
ChEMBL_610979 (CHEMBL1070310)
Ki
0.2±n/a nM
Citation
 Asada, MIwahashi, MObitsu, TKinoshita, ANakai, YOnoda, TNagase, TTanaka, MYamaura, YTakizawa, HYoshikawa, KSato, KNarita, MOhuchida, SNakai, HToda, M 3-(2-Aminocarbonylphenyl)propanoic acid analogs as potent and selective EP3 receptor antagonists. part 2: optimization of the side chains to improve in vitro and in vivo potencies. Bioorg Med Chem 18:1641-58 (2010)  
Target
Name:
Prostaglandin E2 receptor EP3 subtype
Synonyms:
PE2R3_MOUSE Prostaglandin E2 receptor EP3 isoform alpha Prostanoid EP3 receptor Ptgerep3
Type:
G-protein coupled receptor
Mol. Mass.:
40092.50
Organism:
Mus musculus (Mouse)
Description:
Residue:
365
  
Inhibitor
Name:
BDBM50307444
Synonyms:
3-[4-[(3-Cyanophenoxy)methyl]-2-({[3-methyl-1-(3-methylphenyl)butyl]amino}carbonyl)phenyl]propanoic acid | CHEMBL598802
Type:
Small organic molecule
Emp. Form.:
C30H32N2O4
Mol. Mass.:
484.5861
SMILES:
CC(C)CC(NC(=O)c1cc(COc2cccc(c2)C#N)ccc1CCC(O)=O)c1cccc(C)c1
: