Target
D(3) dopamine receptor
Ligand
BDBM50307833
Substrate
Meas. Tech.
ChEMBL_612621 (CHEMBL1065658)
EC50
0.74±n/a nM
Citation
 Ghosh, BAntonio, TReith, MEDutta, AK Discovery of 4-(4-(2-((5-Hydroxy-1,2,3,4-tetrahydronaphthalen-2-yl)(propyl)amino)ethyl)piperazin-1-yl)quinolin-8-ol and its analogues as highly potent dopamine D2/D3 agonists and as iron chelator: in vivo activity indicates potential application in symptomatic and neuroprotective therapy for Parkin J Med Chem 53:2114-25 (2010)  
Target
Name:
D(3) dopamine receptor
Synonyms:
DOPAMINE D3 DRD3_HUMAN Dopamine D3 receptor (D3) Dopamine receptor Dopamine receptor D3
Type:
Mol. Mass.:
44243.43
Organism:
Homo sapiens (Human)
Description:
Residue:
400
  
Inhibitor
Name:
BDBM50307833
Synonyms:
(+)-4-(4-(2-((7-Hydroxy-1,2,3,4-tetrahydronaphthalen-2-yl)(propyl)amino)ethyl)piperazine-1-yl)-quinolin-8-ol CHEMBL599635
Type:
Small organic molecule
Emp. Form.:
C28H36N4O2
Mol. Mass.:
460.611
SMILES:
CCCN(CCN1CCN(CC1)c1ccnc2c(O)cccc12)C1CCc2ccc(O)cc2C1
: