Target
Neuronal acetylcholine receptor subunit alpha-4/beta-2
Ligand
BDBM50302940
Substrate
Meas. Tech.
ChEMBL_610773 (CHEMBL1064408)
IC50
45±n/a nM
Citation
 Carroll, FIBlough, BEMascarella, SWNavarro, HAEaton, JBLukas, RJDamaj, MI Synthesis and biological evaluation of bupropion analogues as potential pharmacotherapies for smoking cessation. J Med Chem 53:2204-14 (2010)  
Target
Name:
Neuronal acetylcholine receptor subunit alpha-4/beta-2
Synonyms:
Neuronal acetylcholine receptor Alpha-4/Beta-2 Neuronal acetylcholine receptor; alpha4/beta2 | nAChR subtypes alpha4 beta2
Type:
Protein
Mol. Mass.:
Description:
Components:
This complex has 2 components.
Component 1
Name:
Neuronal acetylcholine receptor subunit alpha-4
Synonyms:
ACHA4_HUMAN CHRNA4 protein Neuronal acetylcholine receptor protein alpha-4 subunit Nicotinic acetylcholine receptor alpha4/beta2/alpha5
Type:
Mol. Mass.:
69963.49
Organism:
Homo sapiens (Human)
Description:
NACHRA4
Residue:
627
  
Component 2
Name:
Neuronal acetylcholine receptor subunit beta-2
Synonyms:
ACHB2_HUMAN Neuronal acetylcholine receptor protein beta-2 subunit | Nicotinic acetylcholine receptor alpha3/beta2/alpha5
Type:
Protein
Mol. Mass.:
57020.50
Organism:
Homo sapiens (Human)
Description:
P17787
Residue:
502
  
Inhibitor
Name:
BDBM50302940
Synonyms:
2-(tert-butylamino)-1-(3,4-difluorophenyl)propan-1-one CHEMBL578610
Type:
Small organic molecule
Emp. Form.:
C13H17F2NO
Mol. Mass.:
241.277
SMILES:
CC(NC(C)(C)C)C(=O)c1ccc(F)c(F)c1
: